study_id,eureka_id,day,act_in_vehicle_ep_0,act_in_vehicle_ep_1,act_in_vehicle_ep_2,act_in_vehicle_ep_3,act_in_vehicle_ep_4,act_on_bike_ep_0,act_on_bike_ep_1,act_on_bike_ep_2,act_on_bike_ep_3,act_on_bike_ep_4,act_on_foot_ep_0,act_on_foot_ep_1,act_on_foot_ep_2,act_on_foot_ep_3,act_on_foot_ep_4,act_running_ep_0,act_running_ep_1,act_running_ep_2,act_running_ep_3,act_running_ep_4,act_still_ep_0,act_still_ep_1,act_still_ep_2,act_still_ep_3,act_still_ep_4,act_tilting_ep_0,act_tilting_ep_1,act_tilting_ep_2,act_tilting_ep_3,act_tilting_ep_4,act_unknown_ep_0,act_unknown_ep_1,act_unknown_ep_2,act_unknown_ep_3,act_unknown_ep_4,act_walking_ep_0,act_walking_ep_1,act_walking_ep_2,act_walking_ep_3,act_walking_ep_4,audio_amp_mean_ep_0,audio_amp_mean_ep_1,audio_amp_mean_ep_2,audio_amp_mean_ep_3,audio_amp_mean_ep_4,audio_amp_std_ep_0,audio_amp_std_ep_1,audio_amp_std_ep_2,audio_amp_std_ep_3,audio_amp_std_ep_4,audio_convo_duration_ep_0,audio_convo_duration_ep_1,audio_convo_duration_ep_2,audio_convo_duration_ep_3,audio_convo_duration_ep_4,audio_convo_num_ep_0,audio_convo_num_ep_1,audio_convo_num_ep_2,audio_convo_num_ep_3,audio_convo_num_ep_4,audio_voice_ep_0,audio_voice_ep_1,audio_voice_ep_2,audio_voice_ep_3,audio_voice_ep_4,call_in_duration_ep_0,call_in_duration_ep_1,call_in_duration_ep_2,call_in_duration_ep_3,call_in_duration_ep_4,call_in_num_ep_0,call_in_num_ep_1,call_in_num_ep_2,call_in_num_ep_3,call_in_num_ep_4,call_miss_num_ep_0,call_miss_num_ep_1,call_miss_num_ep_2,call_miss_num_ep_3,call_miss_num_ep_4,call_out_duration_ep_0,call_out_duration_ep_1,call_out_duration_ep_2,call_out_duration_ep_3,call_out_duration_ep_4,call_out_num_ep_0,call_out_num_ep_1,call_out_num_ep_2,call_out_num_ep_3,call_out_num_ep_4,ema_CALM,ema_DEPRESSED,ema_HARM,ema_HOPEFUL,ema_SEEING_THINGS,ema_SLEEPING,ema_SOCIAL,ema_STRESSED,ema_THINK,ema_VOICES,ema_neg_score,ema_pos_score,ema_resp_time_median,ema_score,light_mean_ep_0,light_mean_ep_1,light_mean_ep_2,light_mean_ep_3,light_mean_ep_4,light_std_ep_0,light_std_ep_1,light_std_ep_2,light_std_ep_3,light_std_ep_4,loc_dist_ep_0,loc_dist_ep_1,loc_dist_ep_2,loc_dist_ep_3,loc_dist_ep_4,loc_visit_num_ep_0,loc_visit_num_ep_1,loc_visit_num_ep_2,loc_visit_num_ep_3,loc_visit_num_ep_4,quality_activity,quality_audio,quality_gps_on,quality_light,quality_loc,sleep_duration,sleep_end,sleep_start,sms_in_num_ep_0,sms_in_num_ep_1,sms_in_num_ep_2,sms_in_num_ep_3,sms_in_num_ep_4,sms_out_num_ep_0,sms_out_num_ep_1,sms_out_num_ep_2,sms_out_num_ep_3,sms_out_num_ep_4,unlock_duration_ep_0,unlock_duration_ep_1,unlock_duration_ep_2,unlock_duration_ep_3,unlock_duration_ep_4,unlock_num_ep_0,unlock_num_ep_1,unlock_num_ep_2,unlock_num_ep_3,unlock_num_ep_4
-1,u004,20150122,0,0,0,0,0,0,0,0,0,0,0,0,0,0,0,0,0,0,0,0,86399,21599,21600,21600,21600,0,0,0,0,0,0,0,0,0,0,0,0,0,0,0,nan,nan,nan,nan,nan,nan,nan,nan,nan,nan,0,0,0,0,0,0,0,0,0,0,0.0,0.0,0.0,0.0,0.0,0,0,0,0,0,0,0,0,0,0,0,0,0,0,0,0,0,0,0,0,0,0,0,0,0,,,,,,,,,,,,,,,nan,nan,nan,nan,nan,nan,nan,nan,nan,nan,0,0,0,0,0,0,0,0,0,0,0,0,0,0,0,23.75,190,0,1,0,1,0,0,0,0,0,0,0,0,0,0,0,0,0,0,0,0,0
-1,u004,20150123,0,0,0,0,0,0,0,0,0,0,0,0,0,0,0,0,0,0,0,0,86399,21599,21600,21600,21600,0,0,0,0,0,0,0,0,0,0,0,0,0,0,0,nan,nan,nan,nan,nan,nan,nan,nan,nan,nan,0,0,0,0,0,0,0,0,0,0,0.0,0.0,0.0,0.0,0.0,0,0,0,0,0,0,0,0,0,0,0,0,0,0,0,0,0,0,0,0,0,0,0,0,0,,,,,,,,,,,,,,,nan,nan,nan,nan,nan,nan,nan,nan,nan,nan,0,0,0,0,0,0,0,0,0,0,0,0,0,0,0,23.75,190,0,0,0,0,0,0,0,0,0,0,0,0,0,0,0,0,0,0,0,0,0
-1,u004,20150124,0,0,0,0,0,0,0,0,0,0,0,0,0,0,0,0,0,0,0,0,86399,21599,21600,21600,21600,0,0,0,0,0,0,0,0,0,0,0,0,0,0,0,nan,nan,nan,nan,nan,nan,nan,nan,nan,nan,0,0,0,0,0,0,0,0,0,0,0.0,0.0,0.0,0.0,0.0,0,0,0,0,0,0,0,0,0,0,0,0,0,0,0,0,0,0,0,0,0,0,0,0,0,,,,,,,,,,,,,,,nan,nan,nan,nan,nan,nan,nan,nan,nan,nan,0,0,0,0,0,0,0,0,0,0,0,0,0,0,0,23.75,190,0,0,0,0,0,0,0,0,0,0,0,0,0,0,0,0,0,0,0,0,0
-1,u004,20150125,0,0,0,0,0,0,0,0,0,0,0,0,0,0,0,0,0,0,0,0,86399,21599,21600,21600,21600,0,0,0,0,0,0,0,0,0,0,0,0,0,0,0,nan,nan,nan,nan,nan,nan,nan,nan,nan,nan,0,0,0,0,0,0,0,0,0,0,0.0,0.0,0.0,0.0,0.0,0,0,0,0,0,0,0,0,0,0,0,0,0,0,0,0,0,0,0,0,0,0,0,0,0,,,,,,,,,,,,,,,nan,nan,nan,nan,nan,nan,nan,nan,nan,nan,0,0,0,0,0,0,0,0,0,0,0,0,0,0,0,23.75,190,0,0,0,0,0,0,0,0,0,0,0,0,0,0,0,0,0,0,0,0,0
-1,u004,20150126,0,0,0,0,0,0,0,0,0,0,0,0,0,0,0,0,0,0,0,0,86399,21599,21600,21600,21600,0,0,0,0,0,0,0,0,0,0,0,0,0,0,0,nan,nan,nan,nan,nan,nan,nan,nan,nan,nan,0,0,0,0,0,0,0,0,0,0,0.0,0.0,0.0,0.0,0.0,0,0,0,0,0,0,0,0,0,0,0,0,0,0,0,0,0,0,0,0,0,0,0,0,0,,,,,,,,,,,,,,,nan,nan,nan,nan,nan,nan,nan,nan,nan,nan,0,0,0,0,0,0,0,0,0,0,0,0,0,0,0,23.75,190,0,1,0,0,1,0,0,0,0,0,0,0,0,0,0,0,0,0,0,0,0
-1,u004,20150127,0,0,0,0,0,0,0,0,0,0,0,0,0,0,0,0,0,0,0,0,86399,21599,21600,21600,21600,0,0,0,0,0,0,0,0,0,0,0,0,0,0,0,nan,nan,nan,nan,nan,nan,nan,nan,nan,nan,0,0,0,0,0,0,0,0,0,0,0.0,0.0,0.0,0.0,0.0,0,0,0,0,0,0,0,0,0,0,0,0,0,0,0,0,0,0,0,0,0,0,0,0,0,,,,,,,,,,,,,,,nan,nan,nan,nan,nan,nan,nan,nan,nan,nan,0,0,0,0,0,0,0,0,0,0,0,0,0,0,0,23.75,190,0,0,0,0,0,0,0,0,0,0,0,0,0,0,0,0,0,0,0,0,0
-1,u004,20150128,0,0,0,0,0,0,0,0,0,0,0,0,0,0,0,0,0,0,0,0,86398,21599,21599,21600,21600,0,0,0,0,0,1,0,1,0,0,0,0,0,0,0,434.819363223,nan,807.290909091,466.243870968,371.575458392,290.895978477,nan,1173.66874175,232.267423482,44.8643656124,0,0,0,0,0,0,0,0,0,0,0.00779727095517,0.0,0.0909090909091,0.00903225806452,0.0,0,0,0,0,0,0,0,0,0,0,0,0,0,0,0,0,0,0,0,0,0,0,0,0,0,0,1,0,1,0,0,0,0,1,0,1,2,0.0,1,21.7704081633,nan,133.666666667,37.7892156863,2.29189189189,515.998307997,nan,1550.88888889,125.519295463,64.3904747991,,,,,,,,,,,13,13,,13,,13.0,104,0,0,0,0,0,0,0,0,0,0,0,37.766,0,0,37.766,0,1,0,0,1,0
-1,u004,20150129,0,0,0,0,0,0,0,0,0,0,0,0,0,0,0,0,0,0,0,0,86399,21599,21600,21600,21600,0,0,0,0,0,0,0,0,0,0,0,0,0,0,0,447.24708537,387.95712098,434.874293785,483.82357473,nan,159.032135927,20.2951724956,107.447397537,205.221096523,nan,0,0,0,0,0,0,0,0,0,0,0.00263256863483,0.0,0.0,0.00539291217257,0.0,0,0,0,0,0,0,0,0,0,0,0,0,0,0,0,0,0,0,0,0,0,0,0,0,0,,,,,,,,,,,,,,,38.6965317919,0.0,70.277173913,42.4754601227,nan,2008.09576832,0.0,4041.22208767,568.47025669,nan,,,,,,,,,,,14,15,,15,,11.5,92,0,0,0,0,0,0,0,0,0,0,0,0,0,0,0,0,0,0,0,0,0
-1,u004,20150130,0,0,0,0,0,0,0,0,0,0,0,0,0,0,0,0,0,0,0,0,86399,21599,21600,21600,21600,0,0,0,0,0,0,0,0,0,0,0,0,0,0,0,nan,nan,nan,nan,nan,nan,nan,nan,nan,nan,0,0,0,0,0,0,0,0,0,0,0.0,0.0,0.0,0.0,0.0,0,0,0,0,0,0,0,0,0,0,0,0,0,0,0,0,0,0,0,0,0,0,0,0,0,,,,,,,,,,,,,,,nan,nan,nan,nan,nan,nan,nan,nan,nan,nan,0,0,0,0,0,0,0,0,0,0,0,0,0,0,0,23.75,190,0,0,0,0,0,0,0,0,0,0,0,0,0,0,0,0,0,0,0,0,0
-1,u004,20150131,0,0,0,0,0,0,0,0,0,0,0,0,0,0,0,0,0,0,0,0,86399,21599,21600,21600,21600,0,0,0,0,0,0,0,0,0,0,0,0,0,0,0,nan,nan,nan,nan,nan,nan,nan,nan,nan,nan,0,0,0,0,0,0,0,0,0,0,0.0,0.0,0.0,0.0,0.0,0,0,0,0,0,0,0,0,0,0,0,0,0,0,0,0,0,0,0,0,0,0,0,0,0,,,,,,,,,,,,,,,nan,nan,nan,nan,nan,nan,nan,nan,nan,nan,0,0,0,0,0,0,0,0,0,0,0,0,0,0,0,23.75,190,0,0,0,0,0,0,0,0,0,0,0,0,0,0,0,0,0,0,0,0,0
-1,u004,20150201,0,0,0,0,0,0,0,0,0,0,0,0,0,0,0,0,0,0,0,0,86399,21599,21600,21600,21600,0,0,0,0,0,0,0,0,0,0,0,0,0,0,0,nan,nan,nan,nan,nan,nan,nan,nan,nan,nan,0,0,0,0,0,0,0,0,0,0,0.0,0.0,0.0,0.0,0.0,0,0,0,0,0,0,0,0,0,0,0,0,0,0,0,0,0,0,0,0,0,0,0,0,0,,,,,,,,,,,,,,,nan,nan,nan,nan,nan,nan,nan,nan,nan,nan,0,0,0,0,0,0,0,0,0,0,0,0,0,0,0,23.75,190,0,0,0,0,0,0,0,0,0,0,0,0,0,0,0,0,0,0,0,0,0
-1,u004,20150202,0,0,0,0,0,0,0,0,0,0,0,0,0,0,0,0,0,0,0,0,86399,21599,21600,21600,21600,0,0,0,0,0,0,0,0,0,0,0,0,0,0,0,nan,nan,nan,nan,nan,nan,nan,nan,nan,nan,0,0,0,0,0,0,0,0,0,0,0.0,0.0,0.0,0.0,0.0,0,0,0,0,0,0,0,0,0,0,0,0,0,0,0,0,0,0,0,0,0,0,0,0,0,,,,,,,,,,,,,,,nan,nan,nan,nan,nan,nan,nan,nan,nan,nan,0,0,0,0,0,0,0,0,0,0,0,0,0,0,0,23.75,190,0,0,0,0,0,0,0,0,0,0,0,0,0,0,0,0,0,0,0,0,0
-1,u004,20150203,0,0,0,0,0,0,0,0,0,0,0,0,0,0,0,0,0,0,0,0,86399,21599,21600,21600,21600,0,0,0,0,0,0,0,0,0,0,0,0,0,0,0,nan,nan,nan,nan,nan,nan,nan,nan,nan,nan,0,0,0,0,0,0,0,0,0,0,0.0,0.0,0.0,0.0,0.0,0,0,0,0,0,0,0,0,0,0,0,0,0,0,0,0,0,0,0,0,0,0,0,0,0,,,,,,,,,,,,,,,nan,nan,nan,nan,nan,nan,nan,nan,nan,nan,0,0,0,0,0,0,0,0,0,0,0,0,0,0,0,23.75,190,0,0,0,0,0,0,0,0,0,0,0,0,0,0,0,0,0,0,0,0,0
-1,u004,20150204,1764,0,0,0,1764,22,0,0,0,22,191,0,0,0,191,0,0,0,0,0,84330,21599,21600,21555,19576,28,0,0,4,24,64,0,0,41,23,0,0,0,0,0,2056.83634268,nan,nan,291.116647792,2963.30755814,3014.24118608,nan,nan,244.058555868,3361.1197707,1003.0,0,0,160.0,843.0,7,0,0,1,6,0.0810603150211,0.0,0.0,0.0453001132503,0.0994186046512,0,0,0,0,0,0,0,0,0,0,0,0,0,0,0,0,0,0,0,0,0,0,0,0,0,1,0,0,2,0,1,2,2,2,0,2,8,3.0,6,283.98340249,nan,nan,557.713541667,102.755172414,140476.572339,nan,nan,122358.350233,70020.784887,33544.9021737,0,0,0.0,33544.9021737,2,0,0,1,2,11,11,1.0,11,11,17.5,140,0,0,0,0,0,0,0,0,0,0,0,105.86,0,0,100.358,5.502,4,0,0,3,1
-1,u004,20150205,1105,0,0,0,1105,82,0,0,0,82,231,0,0,0,231,0,0,0,0,0,84792,21599,21599,21600,19994,70,0,1,0,69,119,0,0,0,119,0,0,0,0,0,2028.85250452,16.6591549296,86.7963246554,656.236134934,2886.56827057,2220.76760483,17.7732793384,99.7806009066,536.331318048,2374.6074006,17153.0,0,0,4960.0,12193.0,17,0,0,14,3,0.36213049033,0.0,0.00153139356815,0.312607204117,0.420641562064,0,0,0,0,0,0,0,0,0,0,0,0,0,0,0,0,0,0,0,0,0,0,0,0,0,,,,,,,,,,,,,,,58.8799705449,0.0,18.781420765,54.6281628163,74.2865090403,22227.5106297,0.0,413.52599361,303.093860321,40835.8094286,14023.3335303,0.0,0.0,0.0,14023.3335303,3,1,1,1,3,24,24,1.0,24,24,11.5,92,0,0,0,0,0,0,0,0,0,0,0,258.877,0,23.261,2.18,233.436,10,0,2,1,7
-1,u004,20150206,4639,0,1847,2384,408,351,0,219,132,0,644,0,170,34,440,0,0,0,0,0,79348,21599,19291,18831,19627,236,0,31,57,148,1181,0,42,162,977,0,0,0,0,0,1532.37075217,141.366282366,1905.12078009,2603.26995064,830.646187206,2349.49184275,134.078378407,2475.50213989,2935.93266702,1287.65553114,12697.0,0,2861.0,5937.0,3899.0,26,0,7,10,9,0.164319859517,0.0,0.133557498319,0.227684080625,0.22238284544,0,0,0,0,0,0,0,0,0,0,0,0,0,0,0,0,0,0,0,0,0,0,0,0,0,1,0,0,2,0,1,2,2,2,0,2,8,2.0,6,1.82403060337,0.0,3.02225312935,0.586926286509,3.68567454798,29.5649311373,0.0,55.5613963142,0.587367325582,52.3337447119,49841.4201788,0.0,21586.5720873,26221.6147423,2033.23334913,2,1,2,2,1,24,24,1.0,24,24,7.5,88,28,0,0,0,0,0,0,0,0,0,0,730.407,0,255.949,28.152,446.306,14,0,4,2,8
-1,u004,20150207,2919,0,0,2387,532,21,0,0,0,21,2825,0,0,1902,923,0,0,0,0,0,78233,21599,21598,15525,19511,832,0,1,425,406,1569,0,1,1361,207,0,0,0,0,0,2668.06112513,131.529930569,619.35100366,2163.42338429,4666.04112268,3037.67009107,147.776099114,670.320953392,2182.5156138,3280.37938317,32049.0,0,5072.0,8418.0,18559.0,30,0,3,18,10,0.491926658776,0.0,0.376178329821,0.372828353023,0.758126750885,0,0,0,0,0,0,0,0,0,0,0,0,0,0,0,0,0,0,0,0,0,0,0,0,0,,,,,,,,,,,,,,,2.93966266736,0.0,7.29068150209,4.46592489569,0.0,29.6522453392,0.0,51.3744750571,28.6758208066,0.0,25545.7796634,0.0,0.0,20478.3066838,4236.82482714,4,1,1,2,2,24,24,1.0,24,24,9.5,88,12,0,0,0,0,0,0,0,0,0,0,713.69,0,11.293,9.861,692.536,7,0,2,1,4
-1,u004,20150208,3877,866,64,2947,0,0,0,0,0,0,33,0,0,33,0,0,0,0,0,0,81872,20511,21494,18267,21600,232,42,0,190,0,385,180,42,163,0,0,0,0,0,0,1407.8891155,874.843492008,442.090751445,2496.31368093,85.4049183405,1897.20531902,2160.31181113,530.480349591,1903.29564698,111.407145266,16382.0,512.0,2186.0,13684.0,0,10,3,2,5,0,0.33913199964,0.0402248375198,0.154190751445,0.647750146094,0.0065703022339,0,0,0,0,0,0,0,0,0,0,0,0,0,0,0,0,0,0,0,0,0,0,0,0,0,,,,,,,,,,,,,,,8.50330434783,11.7385257302,21.0925539318,1.18497913769,0.0,1688.47538039,5929.17780645,480.87452354,47.1757966268,0.0,33735.5051788,10735.2177195,0.0,21657.855244,0.0,2,1,1,2,1,24,24,1.0,24,24,5.0,88,48,0,0,0,0,0,0,0,0,0,0,50.273,40.531,9.742,0,0,4,3,1,0,0
-1,u004,20150209,262,0,0,0,262,0,0,0,0,0,81,0,0,0,81,0,0,0,0,0,85890,21598,21599,21599,21094,41,1,0,1,39,125,0,1,0,124,0,0,0,0,0,459.923194198,59.457957958,119.666300366,155.853607529,1200.75138835,1040.20702516,50.3666224388,263.762785395,267.007596606,1574.31053526,4061.0,0,191.0,562.0,3308.0,5,0,1,2,2,0.0737154394495,0.0,0.0159340659341,0.0528058556988,0.18067932326,0,0,0,0,0,0,0,0,0,0,0,0,0,0,0,0,0,0,0,0,0,0,0,0,0,,,,,,,,,,,,,,,21.2146086957,0.0,4.43980514962,27.9178844816,52.4937413074,7884.16194311,0.0,16.5080328082,190.921579937,29563.8521861,1751.78164573,120.109142979,0.0,0.0,1631.67250275,2,1,1,1,2,24,24,1.0,24,24,7.0,100,44,1,0,0,0,1,0,0,0,0,0,214.241,0,10.461,0,203.78,11,0,1,0,10
-1,u004,20150210,5403,0,1872,899,2632,529,0,124,405,0,1232,0,128,696,408,0,0,0,0,0,76167,21599,19390,18627,16551,439,0,38,61,340,2629,0,48,912,1669,0,0,0,0,0,1813.47450526,135.226297968,2906.96449192,1592.11748252,2061.80046729,2252.74361716,125.633248329,3990.80455604,1267.75770136,1638.56311139,22706.0,0,2186.0,7438.0,13082.0,27,0,2,10,15,0.345674457825,0.0,0.18331408776,0.390023310023,0.511682242991,11.0,0,0,11.0,0,1,0,0,1,0,0,0,0,0,0,0,0,0,0,0,0,0,0,0,0,,,,,,,,,,,,,,,79.466620306,0.0,0.109874826147,317.756606398,0.0,70586.3716257,0.0,0.413518621327,206635.574974,0.0,61758.831445,0.0,27823.2827673,3536.50319211,24604.4123013,6,1,2,2,4,24,24,1.0,24,24,8.25,90,24,0,0,0,0,0,0,0,0,0,0,1056.553,0,30.514,319.022,707.017,49,0,3,14,32
-1,u004,20150211,4985,0,2852,2133,0,859,0,388,471,0,673,0,287,386,0,0,0,0,0,0,78549,21599,16948,18402,21600,876,0,789,87,0,457,0,336,121,0,0,0,0,0,0,1802.29593048,134.80420105,3010.24957356,2595.46238809,67.5958044578,2953.32816194,147.005937325,3536.35515079,3095.93152766,104.9434348,10098.0,0,5562.0,4536.0,0,12,0,6,6,0,0.157580622644,0.0,0.268869936034,0.23148471108,0.000374601985391,0,0,0,0,0,0,0,0,0,0,0,0,0,0,0,0,0,0,0,0,0,0,0,0,0,,,,,,,,,,,,,,,135.067826087,0.0,44.2729805014,495.445757997,0.42628650904,111518.236443,0.0,59634.3920555,211888.832593,1.40590150901,63478.5250225,0.0,30719.052923,32759.4720996,0.0,2,1,2,2,1,24,24,1.0,24,24,7.0,92,36,0,0,0,0,0,0,0,0,0,0,79.996,19.697,17.969,2.497,39.833,8,1,3,1,3
-1,u004,20150212,1463,0,0,389,1074,0,0,0,0,0,477,0,0,256,221,0,0,0,0,0,83786,21599,21599,20731,19857,281,0,1,78,202,392,0,0,146,246,0,0,0,0,0,1345.96177496,108.872816081,126.836136836,460.34753923,2899.59454561,2066.44883058,124.67630898,144.69376478,1251.55552683,2301.88081423,8864.0,0,0,441.0,8423.0,6,0,0,3,3,0.156963572944,0.0,0.003402003402,0.0417261055635,0.354966773108,0,0,0,0,0,0,0,0,0,0,0,0,0,0,0,0,0,0,0,0,0,0,0,0,0,,,,,,,,,,,,,,,18.1604938272,0.0,5.72670375522,10.8838664812,56.0187760779,5744.79131702,0.0,51.1123745312,23.4726048,20930.2131384,16196.063885,94.512381624,0.0,2174.36964826,13927.1818551,2,1,1,1,2,24,24,1.0,24,24,7.25,88,30,0,0,0,0,0,0,0,0,0,0,49.095,0,9.103,0,39.992,4,0,1,0,3
-1,u004,20150213,2873,0,0,0,2873,31,0,0,0,31,171,0,0,0,171,0,0,0,0,0,82872,21599,21600,21599,18074,300,0,0,1,299,152,0,0,0,152,0,0,0,0,0,2006.22621085,170.664525878,130.971503562,165.474855441,4871.99279416,3368.75263982,120.59611115,139.853833701,233.896449684,3919.47920509,7550.0,0,0,491.0,7059.0,11,0,0,3,8,0.154378394465,0.0,0.00993625796775,0.0394252672157,0.367118611928,0,0,0,0,0,0,0,0,0,0,0,0,0,0,0,0,0,0,0,0,0,0,0,0,0,1,0,0,2,0,0,0,1,3,0,1,6,5.0,5,6.60295652174,0.0,10.3859527121,13.1781489214,2.84770514604,297.32426952,0.0,49.7947122704,27.760886483,996.162480825,26703.9174035,0.0,0.0,0.0,26703.9174035,2,1,1,1,2,24,24,1.0,24,24,7.75,88,26,0,0,0,0,0,0,0,0,0,0,304.928,0,10.21,0,294.718,9,0,1,0,8
-1,u004,20150214,1590,0,621,969,0,0,0,0,0,0,639,0,118,521,0,0,0,0,0,0,80055,21599,19687,17169,21600,603,0,219,384,0,3512,0,955,2557,0,0,0,0,0,0,1041.04910776,82.9751739703,1605.4368932,1296.17770088,613.110099437,1269.3212207,111.401211685,1489.1710648,1348.89147865,621.003417653,20127.0,0,5619.0,10382.0,4126.0,38,0,5,20,14,0.314621662747,0.0,0.41831996623,0.386697424068,0.28501257937,0,0,0,0,0,0,0,0,0,0,0,0,0,0,0,0,0,0,0,0,0,0,0,0,0,,,,,,,,,,,,,,,3.13612656467,0.0,12.1981919332,0.346314325452,0.0,93.9475683067,0.0,265.649871557,0.56574093597,0.0,12461.3766012,0.0,6563.98059531,5857.02081104,0.0,2,1,2,1,1,24,24,1.0,24,24,7.0,88,32,1,0,0,0,1,0,0,0,0,0,26.176,0,6.141,10.295,9.74,3,0,1,1,1
-1,u004,20150215,0,0,0,0,0,0,0,0,0,0,0,0,0,0,0,0,0,0,0,0,86397,21599,21598,21600,21600,0,0,0,0,0,2,0,2,0,0,0,0,0,0,0,304.991190133,106.06335175,411.812928248,399.618930547,236.690507643,333.803732403,170.607087505,460.107848057,280.614109717,129.128579055,4922.0,191.0,3278.0,1453.0,0,12,1,2,9,0,0.104276790005,0.0134438305709,0.262572721396,0.0759065765212,0.00113228911115,0,0,0,0,0,0,0,0,0,0,0,0,0,0,0,0,0,0,0,0,0,0,0,0,0,,,,,,,,,,,,,,,21.7796904886,0.0,5.82197496523,76.3180236604,5.01668984701,2240.91842599,0.0,651.520462859,2777.50568071,1552.65757959,0.0,0.0,0.0,0.0,0.0,1,1,1,1,1,24,24,1.0,24,24,15.0,120,0,0,0,0,0,0,0,0,0,0,0,37.232,0,17.984,19.248,0,3,0,2,1,0
-1,u004,20150216,297,0,0,297,0,0,0,0,0,0,2556,0,0,2556,0,0,0,0,0,0,82002,21599,21600,17246,21557,161,0,0,147,14,1383,0,0,1354,29,0,0,0,0,0,475.038747959,217.447581404,254.894,946.142622537,294.863209025,728.342438876,142.525549997,187.66463279,1105.54825684,345.305945211,5355.0,0,321.0,3540.0,1494.0,22,0,4,15,4,0.081916291665,0.00112930547713,0.0236363636364,0.170161697827,0.0899404575368,0,0,0,0,0,0,0,0,0,0,0,0,0,0,0,0,0,0,0,0,0,0,0,0,0,3,0,0,2,0,3,3,0,3,0,0,14,4.0,14,38.8770648583,0.0,82.5427974948,65.4923504868,7.50347705146,3454.5748713,0.0,3725.25582321,4951.44187473,32.3181381187,2414.48235716,0.0,120.517094858,2293.96526231,0.0,1,1,1,1,1,24,24,1.0,24,24,6.75,86,32,0,0,0,0,0,0,0,0,0,0,275.66,0,0,37.605,238.055,4,0,0,2,2
-1,u004,20150217,2928,0,0,1739,1189,189,0,0,84,105,2776,0,0,133,2643,0,0,0,0,0,78835,21599,21592,19402,16242,664,0,1,199,464,1007,0,7,43,957,0,0,0,0,0,2295.50431023,5.94441303938,213.043734644,896.29376477,3994.5845335,2427.61440101,9.63852620785,386.109156807,1578.89594457,2012.27804173,20186.0,0,1102.0,261.0,18823.0,14,0,3,2,9,0.411480998974,0.0,0.0601146601147,0.0198145791674,0.749791275308,0,0,0,0,0,0,0,0,0,0,0,0,0,0,0,0,0,0,0,0,0,0,0,0,0,,,,,,,,,,,,,,,67.767826087,0.0,133.869262865,137.200417537,0.00278164116829,10715.3375735,0.0,15732.5517534,8751.65781472,0.00555554480899,58018.2409184,0.0,123.834557935,31690.1806664,19186.5181178,3,1,1,1,2,24,24,1.0,24,24,9.0,96,24,0,0,0,0,0,0,0,0,0,0,365.765,0,68.097,2.954,294.714,19,0,3,1,15
-1,u004,20150218,6296,1822,2516,1958,0,22,0,22,0,0,7258,366,1497,4506,889,0,0,0,0,0,64764,19344,15396,9481,20543,1670,65,652,891,62,6389,2,1517,4764,106,0,0,0,0,0,2342.94371876,1115.91091504,2173.44710286,4394.80221867,752.551587882,2531.04083999,1500.16287452,2389.13893397,2443.44987871,1294.98254852,11785.0,2246.0,1162.0,6403.0,1974.0,37,7,7,21,2,0.147117627458,0.0784118400455,0.0833333333333,0.253947631421,0.118688716523,0,0,0,0,0,0,0,0,0,0,0,0,0,0,0,0,0,0,0,0,0,0,0,0,0,3,0,0,3,0,3,2,0,2,0,0,13,2.0,13,84.1072856894,0.0,139.894919972,84.7385257302,111.83449235,498081.228796,0.0,469694.493482,1485045.34749,26612.0059869,25355.9293764,25355.9293764,0,0,0,1,1,0,0,0,16,24,1.0,24,5,5.5,88,44,0,0,0,0,0,0,0,0,0,0,5919.168,40.248,2641.238,3146.014,91.668,49,3,17,26,3
-1,u004,20150219,5297,0,23,2294,2980,0,0,0,0,0,6424,0,1068,4359,997,0,0,0,0,0,65286,21599,18969,10433,14285,4343,0,957,1054,2332,5049,0,583,3460,1006,0,0,0,0,0,3971.40266232,155.896499812,945.506835938,3180.32020967,6954.55635095,3620.2014253,106.156497369,1397.85807158,2117.24460197,2967.6367038,22031.0,0,2557.0,4411.0,15063.0,31,0,11,12,8,0.394162144824,0.0,0.138950892857,0.20361094933,0.734336759667,0,0,0,0,0,0,0,0,0,0,0,0,0,0,0,145.0,0,0,145.0,0,1,0,0,1,0,,,,,,,,,,,,,,,58.7990954949,0.0,162.439499305,71.6536856745,0.981894150418,32546.3403993,0.0,24560.0293717,87759.8188703,98.0679173036,0,0,0,0,0,0,0,0,0,0,15,24,1.0,24,0,8.0,88,24,6,0,1,2,3,6,0,2,1,3,3965.856,0,367.772,2872.959,725.125,65,0,6,38,22
-1,u004,20150220,4945,1,0,2602,2342,21,0,0,21,0,9404,0,828,5617,2959,0,0,0,0,0,58886,14044,20440,9757,14645,10147,7546,113,1853,635,2996,8,219,1750,1019,0,0,0,0,0,2396.21581085,37.7235049205,437.305211849,4086.45577164,2486.4886923,2186.28214008,79.1954326221,1406.40547475,1830.97170816,1707.17968366,23110.0,0,0,10020.0,13090.0,34,0,0,19,16,0.382772627851,0.000189250567752,0.00299962504687,0.446204516939,0.598177464414,0,0,0,0,0,0,0,0,0,0,0,0,0,0,0,0,0,0,0,0,0,0,0,0,0,2,0,0,1,0,0,2,0,2,0,0,7,15.0,7,70.2818640236,0.0,89.356993737,190.14325452,1.640472879,364743.207112,0.0,4835.37777468,1429285.04763,220.577972516,0,0,0,0,0,0,0,0,0,0,15,24,1.0,24,0,4.25,58,24,9,0,0,7,2,5,0,0,5,0,5038.623,30.908,254.616,3792.201,960.898,74,2,7,52,13
-1,u004,20150221,36,36,0,0,0,0,0,0,0,0,179,179,0,0,0,0,0,0,0,0,86133,21333,21600,21600,21600,1,1,0,0,0,50,50,0,0,0,0,0,0,0,0,234.451434697,154.65234448,311.132374333,154.076530612,nan,486.675717571,506.699656359,477.954490853,134.114262103,nan,73.0,73.0,0,0,0,2,2,0,0,0,0.035290237467,0.00336260041098,0.0661063520284,0.00170068027211,0.0,0,0,0,0,0,0,0,0,0,0,0,0,0,0,0,0,0,0,0,0,0,0,0,0,0,,,,,,,,,,,,,,,64.9422251568,14.2679192763,105.351182197,160.467532468,nan,9562.54634843,9834.19892211,5135.92048191,28.2749198853,nan,0,0,0,0,0,0,0,0,0,0,2,13,1.0,13,0,6.75,190,136,0,0,0,0,0,0,0,0,0,0,51.823,42.077,9.746,0,0,4,3,1,0,0
-1,u004,20150309,0,0,0,0,0,0,0,0,0,0,0,0,0,0,0,0,0,0,0,0,53733,21599,21600,10534,0,18,0,0,18,0,32648,0,0,11048,21600,0,0,0,0,0,582.219298246,nan,nan,582.219298246,nan,931.677780671,nan,nan,931.677780671,nan,0,0,0,0,0,0,0,0,0,0,0.0175438596491,0.0,0.0,0.0175438596491,0.0,0,0,0,0,0,0,0,0,0,0,0,0,0,0,0,0,0,0,0,0,0,0,0,0,0,,,,,,,,,,,,,,,61.5,nan,nan,61.5,nan,1667.91666667,nan,nan,1667.91666667,nan,0,0,0,0,0,0,0,0,0,0,1,1,0,1,1,18.5,148,0,0,0,0,0,0,0,0,0,0,0,0,0,0,0,0,0,0,0,0,0
-1,u004,20150310,0,0,0,0,0,0,0,0,0,0,0,0,0,0,0,0,0,0,0,0,86399,21599,21600,21600,21600,0,0,0,0,0,0,0,0,0,0,0,0,0,0,0,nan,nan,nan,nan,nan,nan,nan,nan,nan,nan,0,0,0,0,0,0,0,0,0,0,0.0,0.0,0.0,0.0,0.0,0,0,0,0,0,0,0,0,0,0,0,0,0,0,0,0,0,0,0,0,0,0,0,0,0,,,,,,,,,,,,,,,nan,nan,nan,nan,nan,nan,nan,nan,nan,nan,0,0,0,0,0,0,0,0,0,0,0,0,0,0,0,23.75,190,0,0,0,0,0,0,0,0,0,0,0,0,0,0,0,0,0,0,0,0,0
-1,u004,20150311,0,0,0,0,0,0,0,0,0,0,0,0,0,0,0,0,0,0,0,0,86399,21599,21600,21600,21600,0,0,0,0,0,0,0,0,0,0,0,0,0,0,0,nan,nan,nan,nan,nan,nan,nan,nan,nan,nan,0,0,0,0,0,0,0,0,0,0,0.0,0.0,0.0,0.0,0.0,0,0,0,0,0,0,0,0,0,0,0,0,0,0,0,0,0,0,0,0,0,0,0,0,0,,,,,,,,,,,,,,,nan,nan,nan,nan,nan,nan,nan,nan,nan,nan,0,0,0,0,0,0,0,0,0,0,0,0,0,0,0,23.75,190,0,0,0,0,0,0,0,0,0,0,0,0,0,0,0,0,0,0,0,0,0
-1,u004,20150312,0,0,0,0,0,0,0,0,0,0,0,0,0,0,0,0,0,0,0,0,86399,21599,21600,21600,21600,0,0,0,0,0,0,0,0,0,0,0,0,0,0,0,nan,nan,nan,nan,nan,nan,nan,nan,nan,nan,0,0,0,0,0,0,0,0,0,0,0.0,0.0,0.0,0.0,0.0,0,0,0,0,0,0,0,0,0,0,0,0,0,0,0,0,0,0,0,0,0,0,0,0,0,,,,,,,,,,,,,,,nan,nan,nan,nan,nan,nan,nan,nan,nan,nan,0,0,0,0,0,0,0,0,0,0,0,0,0,0,0,23.75,190,0,0,0,0,0,0,0,0,0,0,0,0,0,0,0,0,0,0,0,0,0
-1,u004,20150313,0,0,0,0,0,0,0,0,0,0,0,0,0,0,0,0,0,0,0,0,86399,21599,21600,21600,21600,0,0,0,0,0,0,0,0,0,0,0,0,0,0,0,nan,nan,nan,nan,nan,nan,nan,nan,nan,nan,0,0,0,0,0,0,0,0,0,0,0.0,0.0,0.0,0.0,0.0,0,0,0,0,0,0,0,0,0,0,0,0,0,0,0,0,0,0,0,0,0,0,0,0,0,,,,,,,,,,,,,,,nan,nan,nan,nan,nan,nan,nan,nan,nan,nan,0,0,0,0,0,0,0,0,0,0,0,0,0,0,0,23.75,190,0,0,0,0,0,0,0,0,0,0,0,0,0,0,0,0,0,0,0,0,0
-1,u004,20150314,0,0,0,0,0,0,0,0,0,0,0,0,0,0,0,0,0,0,0,0,86399,21599,21600,21600,21600,0,0,0,0,0,0,0,0,0,0,0,0,0,0,0,nan,nan,nan,nan,nan,nan,nan,nan,nan,nan,0,0,0,0,0,0,0,0,0,0,0.0,0.0,0.0,0.0,0.0,0,0,0,0,0,0,0,0,0,0,0,0,0,0,0,0,0,0,0,0,0,0,0,0,0,,,,,,,,,,,,,,,nan,nan,nan,nan,nan,nan,nan,nan,nan,nan,0,0,0,0,0,0,0,0,0,0,0,0,0,0,0,23.75,190,0,0,0,0,0,0,0,0,0,0,0,0,0,0,0,0,0,0,0,0,0
-1,u004,20150315,0,0,0,0,0,0,0,0,0,0,0,0,0,0,0,0,0,0,0,0,86399,21599,21600,21600,21600,0,0,0,0,0,0,0,0,0,0,0,0,0,0,0,nan,nan,nan,nan,nan,nan,nan,nan,nan,nan,0,0,0,0,0,0,0,0,0,0,0.0,0.0,0.0,0.0,0.0,0,0,0,0,0,0,0,0,0,0,0,0,0,0,0,0,0,0,0,0,0,0,0,0,0,,,,,,,,,,,,,,,nan,nan,nan,nan,nan,nan,nan,nan,nan,nan,0,0,0,0,0,0,0,0,0,0,0,0,0,0,0,23.75,190,0,0,0,0,0,0,0,0,0,0,0,0,0,0,0,0,0,0,0,0,0